{"text_format":"2","workbook":"xlsx","n_sheets":3,"sheets":["오프라인 시간표(요일별)","온라인 시험 시간표(전공별)","온라인 시험 시간표(날짜별)"],"not_rendered":{"charts":0,"images":0,"macros":0,"external_links":0,"defined_names":1,"comments":0,"pivot_tables":0},"unopened":[],"bounds":{"document_bytes":16777216,"sheet_cells":100000,"run_cost":"one","rows_first":2000,"rows_last":500,"rows_between":2000,"halvings":0,"cell_chars":16384,"cell_head_chars":4096},"cells_cut":0,"cells_raw":0,"read":"whole","date_system":"1900"}

{"sheet":"오프라인 시간표(요일별)","index":0,"n_rows":13,"n_cols":6,"rows_kept":13,"cut":false,"hidden":false,"merged":[[0,0,0,5],[12,4,12,5],[10,4,10,5],[11,4,11,5]]}
["2020학년도 2학기 오프라인 시간표(요일별)"]
[]
["월(19:30~22:10)","화(19:30~22:10)","수(19:30~22:10)","목(19:30~22:10)","토1(9:30~12:10)","토2(13:30~16:10)"]
["마케팅관리(공필)\n손용석\n311호","생산운영관리(공필)\n장병윤\n311호","회계학원론(공필)\n한봉희\n310호","경영정보시스템(공필)\n강주영\n311호","회계학원론(공필)\n윤소라\n309호","재무관리(공필)\n심규철\n309호"]
["조직행위론(공필)\n최명원\n310호","회계감사(전선)\n박주성\n107호","재무관리(공필)\n송영균\n311호","비즈니스코칭(전선)\n김헌수\n309호","마케팅관리(공필)\n이병덕\n311호","조직행위론(공필)\n신강현\n311호"]
["세무회계(전선)\n김광윤\n309호","마케팅유통전략(전선)\n조재운\n310호","인적자원관리(전선)\n박호환\n111호","소비자행동(전선)\n유창조\n107호","경영정보시스템(공필)\n강민철\n506호","IT전략기획(전선)\n이철\n108호"]
["의사결정모델(전선)\n성민제\n108호","금융상품과재무설계(전선)\n은항재(월or화)\n109호","리더십연구(전선)\n조영호\n507호","비즈니스애널리틱스(전선)\n윤강\n106호","전략경영(전선)\n김경호\n507호","비즈니스모델혁신(전선)\n\n506호"]
["벤처창업과경영(전선)\n백종일\n107호","병원전략경영(전선)\n전장식\n506호","마케팅조사(전선)\n이홍재\n307호","국제경영학(전선)\n김영곤\n506호","경영최적화(전선)\n김선교\n108호"]
["코칭기본스킬(전선)\n\n109호","SCM공급망관리(전선)\n김승환\n309호","인문학과경영(전일)\n박구병\n506호","국제비즈니스협상(전선)\nTroy\n507호","경영통계(전일)\n임재익\n310호"]
[null,"갈등관리조정론(전선)\n전현준\n507호","글로벌비교경영(전선)\n김기민\n309호","커뮤니케이션과 퍼실리테이션(전일)\n김동기\n109호","경제원론(전일)\n박영준\n109호"]
[{"$nulls":4},"핵심코칭역량2(전선)\n이은희\n111호"]
[{"$nulls":4},"실전코칭역량(전선)\n이은희\n111호"]
[{"$nulls":4},"SAP연구1(전선) 이성일-308호(PC실습실)\nSAP연구2(전선) 이성일-308호(PC실습실)"]

{"sheet":"온라인 시험 시간표(전공별)","index":1,"n_rows":35,"n_cols":11,"rows_kept":35,"cut":false,"hidden":false,"merged":[[0,0,0,10],[3,0,8,1],[9,0,12,1],[13,1,14,1],[15,1,16,1],[13,0,34,0],[27,1,28,1],[19,1,20,1],[23,1,26,1],[29,1,31,1],[21,1,22,1],[17,1,18,1],[32,1,33,1],[31,4,31,7],[34,4,34,10],[23,4,23,7],[21,4,21,7],[1,0,2,0],[1,1,2,1],[1,2,2,2],[1,3,2,3],[1,4,2,4],[12,4,12,10],[1,5,1,7],[1,8,1,10]]}
["2020학년도 2학기 온라인 중간/기말고사 시간표"]
["구분","세부전공","과목명","담당교수","응시시간(분)","중간고사",null,null,"기말고사"]
[{"$nulls":5},"날짜","요일","시간","날짜","요일","시간"]
["공통필수",null,"경영정보시스템","강민철",{"$f":"VLOOKUP(C4,'온라인 시험 시간표(날짜별)'!B:J,6,0)","v":"25분"},{"$f":"VLOOKUP(C4,'온라인 시험 시간표(날짜별)'!$B:$K,3,0)","v":"2020-10-25"},{"$f":"VLOOKUP(C4,'온라인 시험 시간표(날짜별)'!$B:$K,4,0)","v":"일"},{"$f":"VLOOKUP(C4,'온라인 시험 시간표(날짜별)'!B:K,5,0)","v":"16:30 ~ 17:55"},{"$f":"VLOOKUP(C4,'온라인 시험 시간표(날짜별)'!$B:$K,7,0)","v":"2020-12-20"},{"$f":"VLOOKUP(C4,'온라인 시험 시간표(날짜별)'!$B:$K,8,0)","v":"일"},{"$f":"VLOOKUP(C4,'온라인 시험 시간표(날짜별)'!B:N,9,0)","v":"16:30 ~ 17:55"}]
[null,null,"마케팅관리","황의록",{"$f":"VLOOKUP(C5,'온라인 시험 시간표(날짜별)'!B:J,6,0)","v":"50분"},{"$f":"VLOOKUP(C5,'온라인 시험 시간표(날짜별)'!$B:$K,3,0)","v":"2020-10-18"},{"$f":"VLOOKUP(C5,'온라인 시험 시간표(날짜별)'!$B:$K,4,0)","v":"일"},{"$f":"VLOOKUP(C5,'온라인 시험 시간표(날짜별)'!B:K,5,0)","v":"15:00 ~ 15:50"},{"$f":"VLOOKUP(C5,'온라인 시험 시간표(날짜별)'!$B:$K,7,0)","v":"2020-12-13"},{"$f":"VLOOKUP(C5,'온라인 시험 시간표(날짜별)'!$B:$K,8,0)","v":"일"},{"$f":"VLOOKUP(C5,'온라인 시험 시간표(날짜별)'!B:N,9,0)","v":"16:30 ~ 17:20"}]
[null,null,"생산운영관리","김승환",{"$f":"VLOOKUP(C6,'온라인 시험 시간표(날짜별)'!B:J,6,0)","v":"50분"},{"$f":"VLOOKUP(C6,'온라인 시험 시간표(날짜별)'!$B:$K,3,0)","v":"2020-10-19"},{"$f":"VLOOKUP(C6,'온라인 시험 시간표(날짜별)'!$B:$K,4,0)","v":"월"},{"$f":"VLOOKUP(C6,'온라인 시험 시간표(날짜별)'!B:K,5,0)","v":"22:00 ~ 22:50"},{"$f":"VLOOKUP(C6,'온라인 시험 시간표(날짜별)'!$B:$K,7,0)","v":"2020-12-14"},{"$f":"VLOOKUP(C6,'온라인 시험 시간표(날짜별)'!$B:$K,8,0)","v":"월"},{"$f":"VLOOKUP(C6,'온라인 시험 시간표(날짜별)'!B:N,9,0)","v":"22:00 ~ 22:50"}]
[null,null,"재무관리","송영균",{"$f":"VLOOKUP(C7,'온라인 시험 시간표(날짜별)'!B:J,6,0)","v":"50분"},{"$f":"VLOOKUP(C7,'온라인 시험 시간표(날짜별)'!$B:$K,3,0)","v":"2020-10-18"},{"$f":"VLOOKUP(C7,'온라인 시험 시간표(날짜별)'!$B:$K,4,0)","v":"일"},{"$f":"VLOOKUP(C7,'온라인 시험 시간표(날짜별)'!B:K,5,0)","v":"10:30 ~ 11:20"},{"$f":"VLOOKUP(C7,'온라인 시험 시간표(날짜별)'!$B:$K,7,0)","v":"2020-12-13"},{"$f":"VLOOKUP(C7,'온라인 시험 시간표(날짜별)'!$B:$K,8,0)","v":"일"},{"$f":"VLOOKUP(C7,'온라인 시험 시간표(날짜별)'!B:N,9,0)","v":"10:30 ~ 11:20"}]
[null,null,"조직행위론","박호환",{"$f":"VLOOKUP(C8,'온라인 시험 시간표(날짜별)'!B:J,6,0)","v":"30분"},{"$f":"VLOOKUP(C8,'온라인 시험 시간표(날짜별)'!$B:$K,3,0)","v":"2020-10-23"},{"$f":"VLOOKUP(C8,'온라인 시험 시간표(날짜별)'!$B:$K,4,0)","v":"금"},{"$f":"VLOOKUP(C8,'온라인 시험 시간표(날짜별)'!B:K,5,0)","v":"22:00 ~ 22:30"},{"$f":"VLOOKUP(C8,'온라인 시험 시간표(날짜별)'!$B:$K,7,0)","v":"2020-12-18"},{"$f":"VLOOKUP(C8,'온라인 시험 시간표(날짜별)'!$B:$K,8,0)","v":"금"},{"$f":"VLOOKUP(C8,'온라인 시험 시간표(날짜별)'!B:N,9,0)","v":"22:00 ~ 22:30"}]
[null,null,"회계학원론","한봉희",{"$f":"VLOOKUP(C9,'온라인 시험 시간표(날짜별)'!B:J,6,0)","v":"50분"},{"$f":"VLOOKUP(C9,'온라인 시험 시간표(날짜별)'!$B:$K,3,0)","v":"2020-10-20"},{"$f":"VLOOKUP(C9,'온라인 시험 시간표(날짜별)'!$B:$K,4,0)","v":"화"},{"$f":"VLOOKUP(C9,'온라인 시험 시간표(날짜별)'!B:K,5,0)","v":"22:00 ~ 22:50"},"2020-12-15",{"$f":"VLOOKUP(C9,'온라인 시험 시간표(날짜별)'!$B:$K,8,0)","v":"화"},{"$f":"VLOOKUP(C9,'온라인 시험 시간표(날짜별)'!B:N,9,0)","v":"22:00 ~ 22:50"}]
["일반선택",null,"경영통계","임재익",{"$f":"VLOOKUP(C10,'온라인 시험 시간표(날짜별)'!B:J,6,0)","v":"50분"},{"$f":"VLOOKUP(C10,'온라인 시험 시간표(날짜별)'!$B:$K,3,0)","v":"2020-10-25"},{"$f":"VLOOKUP(C10,'온라인 시험 시간표(날짜별)'!$B:$K,4,0)","v":"일"},{"$f":"VLOOKUP(C10,'온라인 시험 시간표(날짜별)'!B:K,5,0)","v":"15:00 ~ 15:50"},{"$f":"VLOOKUP(C10,'온라인 시험 시간표(날짜별)'!$B:$K,7,0)","v":"2020-12-20"},{"$f":"VLOOKUP(C10,'온라인 시험 시간표(날짜별)'!$B:$K,8,0)","v":"일"},{"$f":"VLOOKUP(C10,'온라인 시험 시간표(날짜별)'!B:N,9,0)","v":"15:00 ~ 15:50"}]
[null,null,"경제원론","김동근",{"$f":"VLOOKUP(C11,'온라인 시험 시간표(날짜별)'!B:J,6,0)","v":"50분"},{"$f":"VLOOKUP(C11,'온라인 시험 시간표(날짜별)'!$B:$K,3,0)","v":"2020-10-18"},{"$f":"VLOOKUP(C11,'온라인 시험 시간표(날짜별)'!$B:$K,4,0)","v":"일"},{"$f":"VLOOKUP(C11,'온라인 시험 시간표(날짜별)'!B:K,5,0)","v":"13:30 ~ 14:20"},{"$f":"VLOOKUP(C11,'온라인 시험 시간표(날짜별)'!$B:$K,7,0)","v":"2020-12-13"},{"$f":"VLOOKUP(C11,'온라인 시험 시간표(날짜별)'!$B:$K,8,0)","v":"일"},{"$f":"VLOOKUP(C11,'온라인 시험 시간표(날짜별)'!B:N,9,0)","v":"13:30 ~ 14:20"}]
[null,null,"연구조사방법론","손영석",{"$f":"VLOOKUP(C12,'온라인 시험 시간표(날짜별)'!B:J,6,0)","v":"50분"},{"$f":"VLOOKUP(C12,'온라인 시험 시간표(날짜별)'!$B:$K,3,0)","v":"2020-10-21"},{"$f":"VLOOKUP(C12,'온라인 시험 시간표(날짜별)'!$B:$K,4,0)","v":"수"},{"$f":"VLOOKUP(C12,'온라인 시험 시간표(날짜별)'!B:K,5,0)","v":"22:00 ~ 22:50"},"2020-12-16",{"$f":"VLOOKUP(C12,'온라인 시험 시간표(날짜별)'!$B:$K,8,0)","v":"수"},{"$f":"VLOOKUP(C12,'온라인 시험 시간표(날짜별)'!B:N,9,0)","v":"22:00 ~ 22:50"}]
[null,null,"아주경영특강","장병윤","출석으로만 평가"]
["전공선택","경영전략","기술및혁신관리","김기민",{"$f":"VLOOKUP(C14,'온라인 시험 시간표(날짜별)'!B:J,6,0)","v":"50분"},{"$f":"VLOOKUP(C14,'온라인 시험 시간표(날짜별)'!$B:$K,3,0)","v":"2020-10-18"},{"$f":"VLOOKUP(C14,'온라인 시험 시간표(날짜별)'!$B:$K,4,0)","v":"일"},{"$f":"VLOOKUP(C14,'온라인 시험 시간표(날짜별)'!B:K,5,0)","v":"9:00 ~ 9:50"},{"$f":"VLOOKUP(C14,'온라인 시험 시간표(날짜별)'!$B:$K,7,0)","v":"2020-12-13"},{"$f":"VLOOKUP(C14,'온라인 시험 시간표(날짜별)'!$B:$K,8,0)","v":"일"},{"$f":"VLOOKUP(C14,'온라인 시험 시간표(날짜별)'!B:N,9,0)","v":"9:00 ~ 9:50"}]
[null,null,"전략경영","김영곤",{"$f":"VLOOKUP(C15,'온라인 시험 시간표(날짜별)'!B:J,6,0)","v":"50분"},{"$f":"VLOOKUP(C15,'온라인 시험 시간표(날짜별)'!$B:$K,3,0)","v":"2020-10-25"},{"$f":"VLOOKUP(C15,'온라인 시험 시간표(날짜별)'!$B:$K,4,0)","v":"일"},{"$f":"VLOOKUP(C15,'온라인 시험 시간표(날짜별)'!B:K,5,0)","v":"12:00 ~ 12:50"},{"$f":"VLOOKUP(C15,'온라인 시험 시간표(날짜별)'!$B:$K,7,0)","v":"2020-12-20"},{"$f":"VLOOKUP(C15,'온라인 시험 시간표(날짜별)'!$B:$K,8,0)","v":"일"},{"$f":"VLOOKUP(C15,'온라인 시험 시간표(날짜별)'!B:N,9,0)","v":"12:00 ~ 12:50"}]
[null,"마케팅","마케팅커뮤니케이션","이미선",{"$f":"VLOOKUP(C16,'온라인 시험 시간표(날짜별)'!B:J,6,0)","v":"40분"},{"$f":"VLOOKUP(C16,'온라인 시험 시간표(날짜별)'!$B:$K,3,0)","v":"2020-10-23"},{"$f":"VLOOKUP(C16,'온라인 시험 시간표(날짜별)'!$B:$K,4,0)","v":"금"},{"$f":"VLOOKUP(C16,'온라인 시험 시간표(날짜별)'!B:K,5,0)","v":"23:00 ~ 23:40"},{"$f":"VLOOKUP(C16,'온라인 시험 시간표(날짜별)'!$B:$K,7,0)","v":"2020-12-18"},{"$f":"VLOOKUP(C16,'온라인 시험 시간표(날짜별)'!$B:$K,8,0)","v":"금"},{"$f":"VLOOKUP(C16,'온라인 시험 시간표(날짜별)'!B:N,9,0)","v":"23:00 ~ 23:40"}]
[null,null,"마켓이노베이션전략","조재운",{"$f":"VLOOKUP(C17,'온라인 시험 시간표(날짜별)'!B:J,6,0)","v":"50분"},{"$f":"VLOOKUP(C17,'온라인 시험 시간표(날짜별)'!$B:$K,3,0)","v":"2020-10-22"},{"$f":"VLOOKUP(C17,'온라인 시험 시간표(날짜별)'!$B:$K,4,0)","v":"목"},{"$f":"VLOOKUP(C17,'온라인 시험 시간표(날짜별)'!B:K,5,0)","v":"22:00 ~ 22:50"},{"$f":"VLOOKUP(C17,'온라인 시험 시간표(날짜별)'!$B:$K,7,0)","v":"2020-12-17"},{"$f":"VLOOKUP(C17,'온라인 시험 시간표(날짜별)'!$B:$K,8,0)","v":"목"},{"$f":"VLOOKUP(C17,'온라인 시험 시간표(날짜별)'!B:N,9,0)","v":"22:00 ~ 22:50"}]
[null,"인사조직","인적자원개발","최명원",{"$f":"VLOOKUP(C18,'온라인 시험 시간표(날짜별)'!B:J,6,0)","v":"50분"},{"$f":"VLOOKUP(C18,'온라인 시험 시간표(날짜별)'!$B:$K,3,0)","v":"2020-10-18"},{"$f":"VLOOKUP(C18,'온라인 시험 시간표(날짜별)'!$B:$K,4,0)","v":"일"},{"$f":"VLOOKUP(C18,'온라인 시험 시간표(날짜별)'!B:K,5,0)","v":"12:00 ~ 12:50"},{"$f":"VLOOKUP(C18,'온라인 시험 시간표(날짜별)'!$B:$K,7,0)","v":"2020-12-13"},{"$f":"VLOOKUP(C18,'온라인 시험 시간표(날짜별)'!$B:$K,8,0)","v":"일"},{"$f":"VLOOKUP(C18,'온라인 시험 시간표(날짜별)'!B:N,9,0)","v":"12:00 ~ 12:50"}]
[null,null,"조직문화","조영호",{"$f":"VLOOKUP(C19,'온라인 시험 시간표(날짜별)'!B:J,6,0)","v":"50분"},{"$f":"VLOOKUP(C19,'온라인 시험 시간표(날짜별)'!$B:$K,3,0)","v":"2020-10-24"},{"$f":"VLOOKUP(C19,'온라인 시험 시간표(날짜별)'!$B:$K,4,0)","v":"토"},{"$f":"VLOOKUP(C19,'온라인 시험 시간표(날짜별)'!B:K,5,0)","v":"21:00 ~ 21:50"},{"$f":"VLOOKUP(C19,'온라인 시험 시간표(날짜별)'!$B:$K,7,0)","v":"2020-12-19"},{"$f":"VLOOKUP(C19,'온라인 시험 시간표(날짜별)'!$B:$K,8,0)","v":"토"},{"$f":"VLOOKUP(C19,'온라인 시험 시간표(날짜별)'!B:N,9,0)","v":"21:00 ~ 21:50"}]
[null,"회계학","정부및비영리회계","오명전",{"$f":"VLOOKUP(C20,'온라인 시험 시간표(날짜별)'!B:J,6,0)","v":"50분"},{"$f":"VLOOKUP(C20,'온라인 시험 시간표(날짜별)'!$B:$K,3,0)","v":"2020-10-25"},{"$f":"VLOOKUP(C20,'온라인 시험 시간표(날짜별)'!$B:$K,4,0)","v":"일"},{"$f":"VLOOKUP(C20,'온라인 시험 시간표(날짜별)'!B:K,5,0)","v":"10:30 ~ 11:20"},{"$f":"VLOOKUP(C20,'온라인 시험 시간표(날짜별)'!$B:$K,7,0)","v":"2020-12-20"},{"$f":"VLOOKUP(C20,'온라인 시험 시간표(날짜별)'!$B:$K,8,0)","v":"일"},{"$f":"VLOOKUP(C20,'온라인 시험 시간표(날짜별)'!B:N,9,0)","v":"10:30 ~ 11:20"}]
[null,null,"재무제표분석","김종일",{"$f":"VLOOKUP(C21,'온라인 시험 시간표(날짜별)'!B:J,6,0)","v":"50분"},{"$f":"VLOOKUP(C21,'온라인 시험 시간표(날짜별)'!$B:$K,3,0)","v":"2020-10-25"},{"$f":"VLOOKUP(C21,'온라인 시험 시간표(날짜별)'!$B:$K,4,0)","v":"일"},{"$f":"VLOOKUP(C21,'온라인 시험 시간표(날짜별)'!B:K,5,0)","v":"9:00 ~ 9:50"},{"$f":"VLOOKUP(C21,'온라인 시험 시간표(날짜별)'!$B:$K,7,0)","v":"2020-12-20"},{"$f":"VLOOKUP(C21,'온라인 시험 시간표(날짜별)'!$B:$K,8,0)","v":"일"},{"$f":"VLOOKUP(C21,'온라인 시험 시간표(날짜별)'!B:N,9,0)","v":"9:00 ~ 9:50"}]
[null,"MS/OM","프로젝트경영","장병윤","과제 대체",null,null,null,{"$f":"VLOOKUP(C22,'온라인 시험 시간표(날짜별)'!$B:$K,7,0)","v":"2020-12-13"},{"$f":"VLOOKUP(C22,'온라인 시험 시간표(날짜별)'!$B:$K,8,0)","v":"일"},{"$f":"VLOOKUP(C22,'온라인 시험 시간표(날짜별)'!B:N,9,0)","v":"15:00 ~ 15:50"}]
[null,null,"서비스관리","김선교",{"$f":"VLOOKUP(C23,'온라인 시험 시간표(날짜별)'!B:J,6,0)","v":"50분"},{"$f":"VLOOKUP(C23,'온라인 시험 시간표(날짜별)'!$B:$K,3,0)","v":"2020-10-18"},{"$f":"VLOOKUP(C23,'온라인 시험 시간표(날짜별)'!$B:$K,4,0)","v":"일"},{"$f":"VLOOKUP(C23,'온라인 시험 시간표(날짜별)'!B:K,5,0)","v":"18:00 ~ 18:50"},{"$f":"VLOOKUP(C23,'온라인 시험 시간표(날짜별)'!$B:$K,7,0)","v":"2020-12-13"},{"$f":"VLOOKUP(C23,'온라인 시험 시간표(날짜별)'!$B:$K,8,0)","v":"일"},{"$f":"VLOOKUP(C23,'온라인 시험 시간표(날짜별)'!B:N,9,0)","v":"19:30 ~ 20:20"}]
[null,"연구기술경영","프로젝트경영","장병윤","과제 대체",null,null,null,{"$f":"VLOOKUP(C24,'온라인 시험 시간표(날짜별)'!$B:$K,7,0)","v":"2020-12-13"},{"$f":"VLOOKUP(C24,'온라인 시험 시간표(날짜별)'!$B:$K,8,0)","v":"일"},{"$f":"VLOOKUP(C24,'온라인 시험 시간표(날짜별)'!B:N,9,0)","v":"15:00 ~ 15:50"}]
[null,null,"마켓이노베이션전략","조재운",{"$f":"VLOOKUP(C25,'온라인 시험 시간표(날짜별)'!B:J,6,0)","v":"50분"},{"$f":"VLOOKUP(C25,'온라인 시험 시간표(날짜별)'!$B:$K,3,0)","v":"2020-10-22"},{"$f":"VLOOKUP(C25,'온라인 시험 시간표(날짜별)'!$B:$K,4,0)","v":"목"},{"$f":"VLOOKUP(C25,'온라인 시험 시간표(날짜별)'!B:K,5,0)","v":"22:00 ~ 22:50"},{"$f":"VLOOKUP(C25,'온라인 시험 시간표(날짜별)'!$B:$K,7,0)","v":"2020-12-17"},{"$f":"VLOOKUP(C25,'온라인 시험 시간표(날짜별)'!$B:$K,8,0)","v":"목"},{"$f":"VLOOKUP(C25,'온라인 시험 시간표(날짜별)'!B:N,9,0)","v":"22:00 ~ 22:50"}]
[null,null,"기술및혁신관리","김기민",{"$f":"VLOOKUP(C26,'온라인 시험 시간표(날짜별)'!B:J,6,0)","v":"50분"},{"$f":"VLOOKUP(C26,'온라인 시험 시간표(날짜별)'!$B:$K,3,0)","v":"2020-10-18"},{"$f":"VLOOKUP(C26,'온라인 시험 시간표(날짜별)'!$B:$K,4,0)","v":"일"},{"$f":"VLOOKUP(C26,'온라인 시험 시간표(날짜별)'!B:K,5,0)","v":"9:00 ~ 9:50"},{"$f":"VLOOKUP(C26,'온라인 시험 시간표(날짜별)'!$B:$K,7,0)","v":"2020-12-13"},{"$f":"VLOOKUP(C26,'온라인 시험 시간표(날짜별)'!$B:$K,8,0)","v":"일"},{"$f":"VLOOKUP(C26,'온라인 시험 시간표(날짜별)'!B:N,9,0)","v":"9:00 ~ 9:50"}]
[null,null,"정부및비영리회계","오명전",{"$f":"VLOOKUP(C27,'온라인 시험 시간표(날짜별)'!B:J,6,0)","v":"50분"},{"$f":"VLOOKUP(C27,'온라인 시험 시간표(날짜별)'!$B:$K,3,0)","v":"2020-10-25"},{"$f":"VLOOKUP(C27,'온라인 시험 시간표(날짜별)'!$B:$K,4,0)","v":"일"},{"$f":"VLOOKUP(C27,'온라인 시험 시간표(날짜별)'!B:K,5,0)","v":"10:30 ~ 11:20"},{"$f":"VLOOKUP(C27,'온라인 시험 시간표(날짜별)'!$B:$K,7,0)","v":"2020-12-20"},{"$f":"VLOOKUP(C27,'온라인 시험 시간표(날짜별)'!$B:$K,8,0)","v":"일"},{"$f":"VLOOKUP(C27,'온라인 시험 시간표(날짜별)'!B:N,9,0)","v":"10:30 ~ 11:20"}]
[null,"재무","금융론","김병화",{"$f":"VLOOKUP(C28,'온라인 시험 시간표(날짜별)'!B:J,6,0)","v":"50분"},{"$f":"VLOOKUP(C28,'온라인 시험 시간표(날짜별)'!$B:$K,3,0)","v":"2020-10-18"},{"$f":"VLOOKUP(C28,'온라인 시험 시간표(날짜별)'!$B:$K,4,0)","v":"일"},{"$f":"VLOOKUP(C28,'온라인 시험 시간표(날짜별)'!B:K,5,0)","v":"16:30 ~ 17:20"},{"$f":"VLOOKUP(C28,'온라인 시험 시간표(날짜별)'!$B:$K,7,0)","v":"2020-12-13"},{"$f":"VLOOKUP(C28,'온라인 시험 시간표(날짜별)'!$B:$K,8,0)","v":"일"},{"$f":"VLOOKUP(C28,'온라인 시험 시간표(날짜별)'!B:N,9,0)","v":"18:00 ~ 18:50"}]
[null,null,"투자론","이주희",{"$f":"VLOOKUP(C29,'온라인 시험 시간표(날짜별)'!B:J,6,0)","v":"50분"},{"$f":"VLOOKUP(C29,'온라인 시험 시간표(날짜별)'!$B:$K,3,0)","v":"2020-10-25"},{"$f":"VLOOKUP(C29,'온라인 시험 시간표(날짜별)'!$B:$K,4,0)","v":"일"},{"$f":"VLOOKUP(C29,'온라인 시험 시간표(날짜별)'!B:K,5,0)","v":"13:30 ~ 14:20"},{"$f":"VLOOKUP(C29,'온라인 시험 시간표(날짜별)'!$B:$K,7,0)","v":"2020-12-20"},{"$f":"VLOOKUP(C29,'온라인 시험 시간표(날짜별)'!$B:$K,8,0)","v":"일"},{"$f":"VLOOKUP(C29,'온라인 시험 시간표(날짜별)'!B:N,9,0)","v":"13:30 ~ 14:20"}]
[null,"헬스케어","서비스관리","김선교",{"$f":"VLOOKUP(C30,'온라인 시험 시간표(날짜별)'!B:J,6,0)","v":"50분"},{"$f":"VLOOKUP(C30,'온라인 시험 시간표(날짜별)'!$B:$K,3,0)","v":"2020-10-18"},{"$f":"VLOOKUP(C30,'온라인 시험 시간표(날짜별)'!$B:$K,4,0)","v":"일"},{"$f":"VLOOKUP(C30,'온라인 시험 시간표(날짜별)'!B:K,5,0)","v":"18:00 ~ 18:50"},{"$f":"VLOOKUP(C30,'온라인 시험 시간표(날짜별)'!$B:$K,7,0)","v":"2020-12-13"},{"$f":"VLOOKUP(C30,'온라인 시험 시간표(날짜별)'!$B:$K,8,0)","v":"일"},{"$f":"VLOOKUP(C30,'온라인 시험 시간표(날짜별)'!B:N,9,0)","v":"19:30 ~ 20:20"}]
[null,null,"정부및비영리회계","오명전",{"$f":"VLOOKUP(C31,'온라인 시험 시간표(날짜별)'!B:J,6,0)","v":"50분"},{"$f":"VLOOKUP(C31,'온라인 시험 시간표(날짜별)'!$B:$K,3,0)","v":"2020-10-25"},{"$f":"VLOOKUP(C31,'온라인 시험 시간표(날짜별)'!$B:$K,4,0)","v":"일"},{"$f":"VLOOKUP(C31,'온라인 시험 시간표(날짜별)'!B:K,5,0)","v":"10:30 ~ 11:20"},{"$f":"VLOOKUP(C31,'온라인 시험 시간표(날짜별)'!$B:$K,7,0)","v":"2020-12-20"},{"$f":"VLOOKUP(C31,'온라인 시험 시간표(날짜별)'!$B:$K,8,0)","v":"일"},{"$f":"VLOOKUP(C31,'온라인 시험 시간표(날짜별)'!B:N,9,0)","v":"10:30 ~ 11:20"}]
[null,null,"프로젝트경영","장병윤","과제 대체",null,null,null,{"$f":"VLOOKUP(C32,'온라인 시험 시간표(날짜별)'!$B:$K,7,0)","v":"2020-12-13"},{"$f":"VLOOKUP(C32,'온라인 시험 시간표(날짜별)'!$B:$K,8,0)","v":"일"},{"$f":"VLOOKUP(C32,'온라인 시험 시간표(날짜별)'!B:N,9,0)","v":"15:00 ~ 15:50"}]
[null,"IT비즈니스","웹환경과비즈니스","이철",{"$f":"VLOOKUP(C33,'온라인 시험 시간표(날짜별)'!B:J,6,0)","v":"50분"},{"$f":"VLOOKUP(C33,'온라인 시험 시간표(날짜별)'!$B:$K,3,0)","v":"2020-10-24"},{"$f":"VLOOKUP(C33,'온라인 시험 시간표(날짜별)'!$B:$K,4,0)","v":"토"},{"$f":"VLOOKUP(C33,'온라인 시험 시간표(날짜별)'!B:K,5,0)","v":"19:30 ~ 20:20"},{"$f":"VLOOKUP(C33,'온라인 시험 시간표(날짜별)'!$B:$K,7,0)","v":"2020-12-19"},{"$f":"VLOOKUP(C33,'온라인 시험 시간표(날짜별)'!$B:$K,8,0)","v":"토"},{"$f":"VLOOKUP(C33,'온라인 시험 시간표(날짜별)'!B:N,9,0)","v":"19:30 ~ 20:20"}]
[null,null,"디지털마케팅","강주영",{"$f":"VLOOKUP(C34,'온라인 시험 시간표(날짜별)'!B:J,6,0)","v":"50분"},{"$f":"VLOOKUP(C34,'온라인 시험 시간표(날짜별)'!$B:$K,3,0)","v":"2020-10-24"},{"$f":"VLOOKUP(C34,'온라인 시험 시간표(날짜별)'!$B:$K,4,0)","v":"토"},{"$f":"VLOOKUP(C34,'온라인 시험 시간표(날짜별)'!B:K,5,0)","v":"18:00 ~ 18:50"},{"$f":"VLOOKUP(C34,'온라인 시험 시간표(날짜별)'!$B:$K,7,0)","v":"2020-12-19"},{"$f":"VLOOKUP(C34,'온라인 시험 시간표(날짜별)'!$B:$K,8,0)","v":"토"},{"$f":"VLOOKUP(C34,'온라인 시험 시간표(날짜별)'!B:N,9,0)","v":"18:00 ~ 18:50"}]
[null,"협상","협상론","박호환","과제 대체"]

{"sheet":"온라인 시험 시간표(날짜별)","index":2,"n_rows":28,"n_cols":11,"rows_kept":28,"cut":false,"hidden":false,"merged":[[27,3,27,10],[0,0,1,10],[2,3,2,6],[2,7,2,10],[8,3,8,6]]}
["2020-2학기 온라인 과목 시험 시간표"]
[]
["No.","과목명","담당교수","중간고사 \n(8주차: 10/17-10/23)",null,null,null,"기말고사\n(16주차: 12/12-12/18)"]
[null,null,null,"날짜","요일","시간","응시시간","날짜","요일","시간","응시시간"]
[1,"기술및혁신관리","김기민","2020-10-18","일","9:00 ~ 9:50","50분","2020-12-13","일","9:00 ~ 9:50","50분"]
[2,"재무관리","송영균","2020-10-18","일","10:30 ~ 11:20","50분","2020-12-13","일","10:30 ~ 11:20","50분"]
[3,"인적자원개발","최명원","2020-10-18","일","12:00 ~ 12:50","50분","2020-12-13","일","12:00 ~ 12:50","50분"]
[4,"경제원론","김동근","2020-10-18","일","13:30 ~ 14:20","50분","2020-12-13","일","13:30 ~ 14:20","50분"]
[5,"프로젝트경영","장병윤","과제 대체",null,null,null,"2020-12-13","일","15:00 ~ 15:50","50분"]
[6,"마케팅관리","황의록","2020-10-18","일","15:00 ~ 15:50","50분","2020-12-13","일","16:30 ~ 17:20","50분"]
[7,"금융론","김병화","2020-10-18","일","16:30 ~ 17:20","50분","2020-12-13","일","18:00 ~ 18:50","50분"]
[8,"서비스관리","김선교","2020-10-18","일","18:00 ~ 18:50","50분","2020-12-13","일","19:30 ~ 20:20","50분"]
[9,"생산운영관리","김승환","2020-10-19","월","22:00 ~ 22:50","50분","2020-12-14","월","22:00 ~ 22:50","50분"]
[10,"회계학원론","한봉희","2020-10-20","화","22:00 ~ 22:50","50분","12월 15일","화","22:00 ~ 22:50","50분"]
[11,"연구조사방법론","손영석","2020-10-21","수","22:00 ~ 22:50","50분","12월 16일","수","22:00 ~ 22:50","50분"]
[12,"마켓이노베이션전략","조재운","2020-10-22","목","22:00 ~ 22:50","50분","2020-12-17","목","22:00 ~ 22:50","50분"]
[13,"조직행위론","박호환","2020-10-23","금","22:00 ~ 22:30","30분","2020-12-18","금","22:00 ~ 22:30","30분"]
[14,"마케팅커뮤니케이션","이미선","2020-10-23","금","23:00 ~ 23:40","40분","2020-12-18","금","23:00 ~ 23:40","40분"]
[15,"디지털마케팅","강주영","2020-10-24","토","18:00 ~ 18:50","50분","2020-12-19","토","18:00 ~ 18:50","50분"]
[16,"웹환경과비즈니스","이철","2020-10-24","토","19:30 ~ 20:20","50분","2020-12-19","토","19:30 ~ 20:20","50분"]
[17,"조직문화","조영호","2020-10-24","토","21:00 ~ 21:50","50분","2020-12-19","토","21:00 ~ 21:50","50분"]
[18,"재무제표분석","김종일","2020-10-25","일","9:00 ~ 9:50","50분","2020-12-20","일","9:00 ~ 9:50","50분"]
[19,"정부및비영리회계","오명전","2020-10-25","일","10:30 ~ 11:20","50분","2020-12-20","일","10:30 ~ 11:20","50분"]
[20,"전략경영","김영곤","2020-10-25","일","12:00 ~ 12:50","50분","2020-12-20","일","12:00 ~ 12:50","50분"]
[21,"투자론","이주희","2020-10-25","일","13:30 ~ 14:20","50분","2020-12-20","일","13:30 ~ 14:20","50분"]
[22,"경영통계","임재익","2020-10-25","일","15:00 ~ 15:50","50분","2020-12-20","일","15:00 ~ 15:50","50분"]
[23,"경영정보시스템","강민철","2020-10-25","일","16:30 ~ 17:55","25분","2020-12-20","일","16:30 ~ 17:55","25분"]
[24,"협상론","박호환","과제 대체"]